{"text_format":"1","workbook":"xlsx","n_sheets":4,"sheets":["F. Compra e instalación_VF","CheckBox","Tablas","Objetos-CeCos-Unidades"],"not_rendered":{"charts":0,"images":1,"macros":1,"external_links":1,"defined_names":1,"comments":1,"pivot_tables":0},"unopened":[],"bounds":{"document_bytes":16777216,"sheet_cells":100000,"rows_first":2000,"rows_last":500,"rows_between":2000,"halvings":0,"cell_chars":16384,"cell_head_chars":4096},"cells_cut":0,"cells_raw":0,"read":"row_number_cap","date_system":"1900"}

{"sheet":"F. Compra e instalación_VF","index":0,"n_rows":84,"n_cols":25,"rows_kept":84,"cut":false,"hidden":false,"merged":[[58,16,58,21],[58,22,58,24],[51,12,51,24],[53,8,53,11],[54,3,54,7],[40,6,40,7],[40,3,40,5],[54,8,54,11],[54,12,54,15],[54,16,54,24],[50,12,50,15],[46,22,46,24],[48,16,48,21],[49,8,49,11],[49,12,49,24],[50,3,50,7],[50,8,50,11],[50,16,50,24],[46,8,46,11],[46,12,46,15],[48,3,48,7],[48,8,48,11],[47,16,47,21],[42,12,42,15],[40,8,40,15],[40,16,40,21],[40,22,40,23],[37,3,37,7],[37,8,37,11],[26,2,26,7],[26,8,26,10],[26,11,26,14],[26,15,26,21],[26,22,26,24],[27,8,27,10],[27,22,27,24],[27,2,27,7],[33,1,51,2],[47,22,47,24],[46,16,46,21],[42,16,42,21],[43,12,43,24],[41,3,41,7],[42,3,42,7],[42,8,42,11],[39,3,39,7],[39,8,39,11],[39,12,39,15],[39,16,39,21],[82,1,83,19],[82,20,82,24],[83,20,83,22],[83,23,83,24],[75,2,75,6],[75,7,75,9],[75,10,75,14],[75,15,75,22],[75,23,75,24],[77,1,77,24],[76,1,76,24],[73,2,73,6],[73,7,73,9],[73,10,73,14],[73,15,73,22],[73,23,73,24],[74,2,74,6],[80,2,80,6],[80,7,80,9],[39,22,39,23],[80,10,80,19],[80,20,80,22],[80,23,80,24],[81,1,81,24],[78,1,78,6],[78,7,78,19],[78,20,78,24],[79,2,79,6],[79,7,79,9],[79,10,79,19],[79,20,79,22],[79,23,79,24],[74,7,74,9],[74,10,74,14],[74,15,74,22],[74,23,74,24],[71,1,71,6],[71,7,71,14],[71,15,71,24],[72,2,72,6],[72,7,72,9],[72,10,72,14],[72,15,72,22],[72,23,72,24],[66,1,66,6],[66,7,66,24],[67,1,67,24],[68,1,68,24],[69,1,69,24],[70,1,70,24],[62,1,62,24],[63,1,63,14],[64,1,64,14],[65,1,65,14],[63,15,63,23],[64,15,64,23],[65,15,65,23],[61,1,61,2],[61,3,61,14],[61,15,61,22],[61,23,61,24],[59,16,59,21],[59,3,59,7],[59,8,59,13],[59,14,59,15],[59,22,59,23],[52,1,59,2],[60,1,60,2],[57,3,57,7],[57,8,57,11],[57,12,57,15],[57,16,57,24],[55,3,55,7],[55,8,55,11],[55,12,55,15],[55,16,55,24],[56,3,56,7],[56,8,56,11],[56,12,56,15],[56,16,56,24],[58,3,58,15],[53,12,53,24],[53,3,53,7],[51,3,51,7],[52,3,52,7],[52,8,52,11],[51,8,51,11],[49,3,49,7],[47,3,47,7],[47,8,47,11],[47,12,47,15],[48,12,48,15],[52,12,52,15],[52,16,52,24],[45,3,45,7],[45,8,45,11],[45,12,45,15],[45,16,45,24],[46,3,46,7],[43,3,43,7],[43,8,43,11],[44,16,44,21],[44,22,44,24],[44,3,44,7],[44,8,44,15],[34,16,34,21],[34,22,34,23],[37,12,37,15],[38,3,38,7],[38,8,38,11],[38,12,38,24],[37,16,37,21],[37,22,37,24],[35,16,35,21],[36,3,36,7],[36,8,36,11],[36,12,36,15],[36,16,36,21],[36,22,36,24],[35,3,35,7],[35,12,35,15],[28,1,28,24],[29,7,29,8],[29,20,29,22],[27,11,27,14],[27,15,27,21],[24,2,24,6],[24,7,24,9],[24,10,24,19],[24,20,24,22],[24,23,24,24],[25,1,25,24],[22,2,22,6],[22,7,22,9],[22,10,22,19],[22,20,22,22],[22,23,22,24],[23,2,23,6],[23,7,23,9],[23,10,23,19],[23,20,23,22],[23,23,23,24],[19,2,19,24],[21,1,21,24],[18,1,19,1],[18,8,18,11],[17,8,17,11],[17,12,17,14],[17,15,17,17],[17,18,17,20],[17,21,17,23],[18,2,18,5],[18,6,18,7],[18,12,18,14],[18,15,18,17],[18,18,18,20],[18,21,18,24],[17,2,17,5],[17,6,17,7],[20,2,20,24],[7,15,7,24],[8,1,8,9],[8,10,8,14],[8,15,8,24],[14,2,14,24],[15,1,16,1],[15,4,15,8],[15,9,16,14],[15,15,16,24],[16,4,16,8],[12,2,12,8],[12,9,12,14],[12,15,12,24],[13,23,13,24],[15,2,16,3],[13,2,13,22],[30,20,30,22],[4,4,4,19],[4,21,4,24],[5,1,5,24],[6,1,6,6],[6,7,6,9],[6,10,6,14],[6,15,6,24],[1,4,1,20],[1,21,1,24],[2,4,2,20],[2,21,2,24],[3,4,3,19],[3,21,3,24],[9,1,9,9],[9,10,9,14],[9,15,9,24],[10,1,10,24],[11,2,11,8],[11,9,11,14],[11,15,11,24],[7,1,7,6],[7,7,7,9],[7,10,7,14],[41,8,41,24],[60,14,60,18],[60,19,60,24],[60,3,60,13],[31,2,31,24],[29,1,30,1],[29,2,30,6],[42,22,42,24],[35,8,35,11],[48,22,48,24],[35,22,35,24],[29,23,29,24],[30,23,30,24],[29,14,29,19],[30,14,30,19],[29,9,29,13],[30,9,30,13],[32,1,32,24],[33,3,33,7],[33,8,33,24],[34,3,34,7],[34,8,34,11],[34,12,34,15],[30,7,30,8]],"read":"row_number_cap"}
[]
[null,null,null,null,"FORMATO VIABILIDAD DE COMPRA E INSTALACION DE EQUIPOS",null,null,null,null,null,null,null,null,null,null,null,null,null,null,null,null,"FECHA DE ELABORACIÓN"]
[null,null,null,null,"VICERRECTORÍA ADMINISTRATIVA Y FINANCIERA",null,null,null,null,null,null,null,null,null,null,null,null,null,null,null,null,{"$f":"+TODAY()","v":"2022-06-22"}]
[null,null,null,null,"FOR-27-1-02-03 / V.2",null,null,null,null,null,null,null,null,null,null,null,null,null,null,null,null,"VIABILIDAD NO. "]
[null,null,null,null,"(Diligencie los campos resaltados en azul)",null,null,null,null,null,null,null,null,null,null,null,null,null,null,null,null,"espacio exclusivo para VSS"]
[null,"1. INFORMACIÓN GENERAL"]
[null,"1.1. UNIDAD SOLICITANTE",null,null,null,null,null,"1.2. TIPO OBJETO DE COSTO",null,null,"1.3. NÚMERO OBJETO DE COSTO",null,null,null,null,"1.4.  NOMBRE OBJETO DE COSTO"]
[]
[null,"1.5. NOMBRE DE LA PERSONA RESPONSABLE DEL BIEN",null,null,null,null,null,null,null,null,"1.6. EXTENSIÓN",null,null,null,null,"1.7. CORREO ELECTRÓNICO"]
[]
[null,"2. INFORMACIÓN DE LA COMPRA"]
[null,"2.1. TIPO COMPRA:","[Seleccione]",null,null,null,null,null,null,"SI ES OTRO TIPO DE COMPRA, INDIQUE CUÁL:"]
[null,"2.2. MARCA/NOMBRE:",null,null,null,null,null,null,null,"2.3. VERSION/MODELO: "]
[null,"2.4. TIPO DE USO:"]
[null,"2.5. MOTIVO POR EL CUAL REALIZA LA COMPRA:"]
[null,"2.6. ¿REQUIERE SOFTWARE ESPECIALIZADO? ",null,null,"¿CUÁL?",null,null,null,null,"REQUERIMIENTOS ESPECIALES:"]
[]
[null,"2.7. TIPO DE SOPORTE:",null,null,null,null,"¿OTRO TIPO DE SOPORTE?\n¿CUÁL?",null,null,null,null,null,"TIEMPO DE CONTRATO DEL SOPORTE EN MESES/AÑOS:",null,null,null,null,null,"[Seleccione]",null,null,"SITIO DONDE VA A SER INSTALADO:",null,null,"[Seleccione]"]
[null,"2.8. GARANTÍA",null,null,null,null,"TIPO DE GARANTÍA",null,"[Seleccione]",null,null,null,"¿OTRO TIPO/TIEMPO DE GARANTÍA?, ¿CUÁL?",null,null,null,null,null,"[Seleccione]",null,null,{"$f":"+IFERROR(VLOOKUP(I19,Tablas!$J$4:$K$7,2,0),\"\")","v":""}]
[null,null,"RECUERDE QUE:\nPor disposición de la Universidad, el periodo de garantía mínimo establecido para compra de equipos de cómputo es: \n     *Equipos Windows cuatro 48 meses (4 años): 1 año de fábrica y 3 años de garantía extendida\n     *Equipos MAC 36 meses (3 años): 1 año de fábrica y 2 años adicionales de garantía extendida"]
[null,"2.9. DESTINO DE LA COMPRA:"]
[null,"NOTA: SI ES UNA REPOSICIÓN O UNA ADICIÓN A UN ACTIVO, POR FAVOR DILIGENCIE LA SIGUIENTE INFORMACIÓN DEL ACTIVO AFECTADO:"]
[null,"NUMERO ACTIVO","MARCA Y MODELO ",null,null,null,null,"CENTRO DE COSTO ORACLE",null,null,"RESPONSABLE ",null,null,null,null,null,null,null,null,null,"EXT. ",null,null,"UBICACIÓN FISICA "]
[]
[]
[null,"3. INFORMACIÓN DEL PROVEEDOR"]
[null,"3.1. NOMBRE DEL PROVEEDOR:",null,null,null,null,null,null,"3.2. NIT:",null,null,null,null,null,null,"3.3. DIRECCIÓN:"]
[null,"3.4. EMAIL DEL PROVEEDOR:",null,null,null,null,null,null,"3.5. TELÉFONO:",null,null,null,null,null,null,"3.6. NOMBRE DEL CONTACTO:"]
[null,"4. CONDICIONES COMERCIALES"]
[null,"4.1. VALOR  ¿IVA INCLUIDO?:",null,null,null,null,null,"4.1.1. CANTIDAD",null,"4.1.2. PRECIO UNITARIO",null,null,null,null,"4.1.3. VALOR TOTAL",null,null,null,null,null,"4.1.4. MONEDA",null,null,"4.1.5. FORMA DE PAGO"]
[null,null,null,null,null,null,null,null,null,null,null,null,null,null,{"$f":"+H31*J31","v":0}]
[null,"4.2. OBSERVACIONES:"]
[null,"5. INFORMACIÓN DEL EQUIPO\n(Diligencie la información que aplique de acuerdo al tipo equipo que se va a adquirir)"]
[null,"CARACTERISTICAS:",null,"5.1. UBICACIÓN FINAL DEL EQUIPO (Espacio con la respectiva nomenclatura:"]
[null,null,null,"5.2. CAPACIDAD ELÉCTRICA:",null,null,null,null,null,null,null,null,"POTENCIA:",null,null,null,null,null,null,null,null,null,"VOLTAJE:"]
[null,null,null,"No. DE FASES / CONFIGURACIÓN:",null,null,null,null,null,null,null,null,"FRECUENCIA:"]
[null,null,null,"5.3. LÍNEA TELEFÓNICA:",null,null,null,null,null,null,null,null,"No. de PUNTOS:"]
[null,null,null,"5.4. PUNTOS DE DATOS:",null,null,null,null,null,null,null,null,"No. de PUNTOS:"]
[null,null,null,"5.5. RED INALÁMBRICA:"]
[null,null,null,"5.6. PUNTOS DE AGUA:",null,null,null,null,null,null,null,null,"No. de PUNTOS:",null,null,null,null,null,null,null,null,null,"PRESION:"]
[null,null,null,"TEMPERATURA:",null,null,"[Seleccione]",null,"¿REQUIERE PH Y DUREZA ESPECÍFICA?:",null,null,null,null,null,null,null,null,null,null,null,null,null,"CAUDAL:"]
[null,null,null,"5.7. DESAGÜES:"]
[null,null,null,"5.8. GASES ESPECIALES:",null,null,null,null,null,null,null,null,"TIPO DE GAS:"]
[null,null,null,"¿REQUIERE LÍQUIDOS CRIOGÉNICOS?:"]
[null,null,null,"CONCENTRACIÓN DE LOS GASES (%/%, mg/L, ug/ml):",null,null,null,null,null,null,null,null,null,null,null,null,"ANTICHISPA:"]
[null,null,null,"5.9. SENSORES DE GASES:",null,null,null,null,null,null,null,null,"TIPO DE GAS:"]
[null,null,null,"No. SENSORES:",null,null,null,null,null,null,null,null,null,null,null,null,"TIPO DE ALARMAS:"]
[null,null,null,"5.10. AIRE COMPRIMIDO:",null,null,null,null,null,null,null,null,"No. DE PUNTOS:"]
[null,null,null,"PRESION:",null,null,null,null,null,null,null,null,"PUREZA:"]
[null,null,null,"5.11. CONTROL TÉRMICO:"]
[null,null,null,"NIVEL MAXIMO:",null,null,null,null,null,null,null,null,"NIVEL MÍNIMO:"]
[null,null,null,"5.12. CONTROL HUMEDAD:"]
[null,"CARACTERISTICAS (Cont):",null,"NIVEL MAXIMO:",null,null,null,null,null,null,null,null,"NIVEL MÍNIMO:"]
[null,null,null,"5.13. CONTROL MATERIAL PARTICULADO:"]
[null,null,null,"NIVEL MAXIMO:",null,null,null,null,null,null,null,null,"NIVEL MÍNIMO:"]
[null,null,null,"5.14. EMISIONES:",null,null,null,null,null,null,null,null,"TIPO EMISIÓN:"]
[null,null,null,"5.15. SIST. DE EXTRACCIÓN:",null,null,null,null,null,null,null,null,"TIPO SISTEMA:"]
[null,null,null,"5.16. COMBUSTIBLES:",null,null,null,null,null,null,null,null,"TIPO COMBUSTIBLE:"]
[null,null,null,"5.17. INSTALACIÓN O TRASLADO DE EQUIPOS QUE EMITEN RADIACIÓN:"]
[null,null,null,"5.18. DIMENSIONES (Ancho x Profundo x Alto):",null,null,null,null,null,null,null,null,null,null,"Cm",null,"5.19. PESO",null,null,null,null,null,null,null,"Kg"]
{"$rows_left_out":25}
{"sheet":"CheckBox","index":1,"n_rows":27,"n_cols":1,"rows_kept":27,"cut":false,"hidden":true,"merged":[]}
["2.4. TIPO DE USO:"]
["2.1. TIPO COMPRA:"]
["2.8. GARANTÍA"]
["2.9. DESTINO DE LA COMPRA:"]
["4.1. VALOR  ¿IVA INCLUIDO?:"]
["5.2. CAPACIDAD ELÉCTRICA:"]
["5.3. LÍNEA TELEFÓNICA:"]
["5.4. PUNTOS DE DATOS:"]
["5.5. RED INALÁMBRICA:"]
["5.6. PUNTOS DE AGUA:"]
["¿REQUIERE PH Y DUREZA ESPECÍFICA?:"]
["5.7. DESAGÜES:"]
["¿REQUIERE LÍQUIDOS CRIOGÉNICOS?:"]
["5.9. SENSORES DE GASES:"]
["5.10. AIRE COMPRIMIDO:"]
["5.11. CONTROL TÉRMICO:"]
["5.12. CONTROL HUMEDAD:"]
["5.13. CONTROL MATERIAL PARTICULADO:"]
["5.14. EMISIONES:"]
["5.15. SIST. DE EXTRACCIÓN:"]
["5.16. COMBUSTIBLES:"]
["5.17. INSTALACIÓN O TRASLADO DE EQUIPOS QUE EMITEN RADIACIÓN:"]
["¿LA OFERTA INCLUYE PLAN DE MANTENIMIENTO?:"]
["6.1. ¿Se generan nuevos peligros….."]
["6.2. ¿Se requiere tomar capacitación…."]
["6.3. ¿Se requiere elementos de protección"]
["¿EL EQUIPO REQUIERE PLAN DE MANTENIMIENTO?"]

{"sheet":"Tablas","index":2,"n_rows":10,"n_cols":17,"rows_kept":10,"cut":false,"hidden":true,"merged":[]}
[]
[]
[null,"Objeto de costo",null,"Tipo de compra",null,"Temperatura",null,"Alarmas",null,"Tipo de Garantia","Tiempo garantía en meses",null,"Tipo de soporte",null,"SITIO DONDE VA A SER INSTALADO",null,"Tiempo soporte"]
[null,"Centro de costo",null,"Electrodoméstico",null,"Fria ",null,"Local",null,"1 Año",12,null,"7X24",null,"Oficina campus",null,"Días"]
[null,"Objeto",null,"Equipo de laboratorio",null,"Caliente",null,"Remota",null,"2 Años",24,null,"5X8",null,"Laboratorio",null,"Meses"]
[null,"Proyecto",null,"Montajes en taller o laboratorio",null,"Ambas",null,"Ambas",null,"3 Años",36,null,"Desplazamiento en sitio",null,"Sala de computadores",null,"Años"]
[null,null,null,"Computador",null,null,null,null,null,"Otra","[Ingrese # de meses]",null,"No tiene",null,"Datacenter"]
[null,null,null,"Servidor",null,null,null,null,null,null,null,null,"Otro",null,"CI"]
[null,null,null,"Escritorio/servidor virtual"]
[null,null,null,"Otros"]

{"sheet":"Objetos-CeCos-Unidades","index":3,"n_rows":2725,"n_cols":8,"rows_kept":2725,"cut":false,"hidden":true,"merged":[[0,0,0,1],[0,3,0,4],[0,6,0,7]]}
["OBJETO ORACLE",null," ","UNIDAD ORACLE",null,null,"CENTRO DE COSTO ORACLE"]
["CODIGO","DESCRIPCION"," ","CODIGO","DESCRIPCION",null,"CODIGO","DESCRIPCION"]
["DON0120001","FONDO PROGRAMA PENSADORES DEL MUNDO"," ",9000,"APOYO Y ENDOWMENT AD",null,"DON01001","DONACIONES DE CONSUMO"]
["DON0120002","FONDO PROGRAMA QEE PT INVERSIONES","  ",1000,"FACULTAD DE ADMINISTRACION",null,"DON02001","DONACIONES MIXTAS"]
["DON0120009","BECA QUIERO ESTUDIAR ATEMPI"," ",1400,"FACULTAD DE ARTES Y HUMANIDADES",null,"DON03001","DONACIONES PATRIMONIALES"]
["DON0120010","FONDO QE ESCALA BANCOLOMBIA"," ",1403,"DPTO HISTORIA DEL ARTE",null,"DON04002","FIDUCOLOMBIA"]
["DON0120011","FONDO QUIERO ESTUDIAR BAVARIA"," ",1600,"DPTO DE FISICA",null,"SST01001","SERVICIOS DE SOPORTE "]
["DON0120012","FONDO PROGRAMA QEE BXB"," ",1800,"FACULTAD DE CIENCIAS SOCIALES",null,"DPO13001","MAESTRIAS"]
["DON0120013","BECA CALASANZ CIUDAD BOLÍVAR"," ",1801,"DPTO ANTROPOLOGIA",null,"IDI28001","DIVULGACION DI"]
["DON0120014","FONDO QE ESCALA EX-BECARIOS CARLOS ANGULO GALVIS"," ",1805,"DPTO LENGUAS Y CULTURA",null,"IEC26001","CURSOS EDUCACION CONTINUA / EJECUTIVA"]
["DON0120015","FONDO PROGRAMA PALANTE CARIBE CARIBE PACHECO DEVIA"," ",1806,"PSICOLOGIA",null,"SST06001","RELACIONAMIENTO EXTERNO "]
["DON0120016","BECA QUIERO ESTUDIAR CASA LIMPIA"," ",2000,"FACULTAD DE DERECHO",null,"SST05001","POSICIONAMIENTO "]
["DON0120017","FONDO QE ESCALA CASALIMPIA"," ",2000,"FACULTAD DE DERECHO ",null,"PPA23001","DIVULGACION PA "]
["DON0120018","FONDO QUIERO ESTUDIAR CHAID NEME"," ",2200,"FACULTAD DE ECONOMÍA",null,"PPA22001","PI PRODUCCION ACADEMICA"]
["DON0120019","FONDO BECA MAESTRÍA CEGA-EGOB"," ",2407,"DPTO ING SISTEMAS",null,"PPA23001","DIVULGACIÓN PA"]
["DON0120020","CÁTEDRA CEGA-EGOB"," ",2402,"DPTO CIVIL Y AMBIENTAL",null,"SST02009","LAB PROD ACADÉMICA-ASESORIA Y CONSULTORIA-SERVICIOS"]
["DON0120021","FONDO PROGRAMA QEN CEGA"," ",2403,"DPTO ELECTRICA Y ELECTRONICA",null,"IAC25001","PE SERVICIOS "]
["DON0120022","FONDO PROGRAMA QEE CEGA-CIFOE"," ",2400,"FACULTAD DE INGENIERÍA",null,"DPR11001","PREGRADOS"]
["DON0120023","BECA CIRO ANGARITA BARÓN"," ",2404,"DPTO ING INDUSTRIAL",null,"NNF02001","ESCUELA DE PREGRADO "]
["DON0120024","PROGRAMA QEE CITY PARK"," ",2406,"DPTO ING. QUIMICA",null,"IEC26201","CURSOS EDUCACION CONTINUA DIRECCION EDU CON"]
["DON0120025","FONDO PROGRAMA QEE COLSUBSIDIO"," ",2401,"DPTO ING. BIÓMEDICA",null,"IEC26201","CURSOS EDUCACION CONTINUA / EJECUTIVA"]
["DON0120026","QEE PACÍFICO CORREDORES DAVIVIENDA"," ",2405,"DPTO. ING. MECANICA",null,"DPO15001","ESCUELAS DE VERANO"]
["DON0120027","FONDO PROGRAMA QEE CUNDINAMARCA"," ",2404,"DPTO ING. INDUSTRIAL",null,"NNF05001","PROD ACADEMICA Y CENTROS DE INV "]
["DON0120028","DONACIÓN FUNDACIÓN BOLIVAR DAVIVIENDA ECONOMÍA"," ",2800,"ESCUELA DE GOBIERNO",null,"NNF01001","DECANATURA "]
["DON0120029","DONACIÓN FUNDACIÓN BOLIVAR DAVIVIENDA BIOLOGÍA"," ",3000,"CENTRO INTERDICIPLINARIO ESTUDIOS DLLO",null,"NNF03001","ESCUELA DE POSGRADO "]
["DON0120030","FONDO APOYO PARA MAESTRÍA EGOB-DICORP"," ",2600,"FACULTAD DE MEDICINA",null,"IEC26001","CURSOS EDUCACION CONTINUA "]
["DON0120031","FONDO QE ESCALA DISAN"," ",3200,"FACULTAD DE EDUCACION",null,"SST03001","TAL DOCENCIA"]
["DON0120032","FONDO PROGRAMA PALANTE CARIBE EBAD"," ",5000,"ADMINISTRATIVOS OP",null,"SST02001","LAB DOCENCIA"]
["DON0120033","FONDO PROGRAMA QEE EBAD & CÍA SCA"," ",6000,"PROYECTOS INSTITUACIONALES PI",null,"DPO12001","ESPECIALIZACIONES"]
["DON0120034","FEGV DE APOYO A LA EDUCACIÓN VIRTUAL (CONECTA-TE)"," ",8000,"RECURSOS INSTITUCIONALES RI",null,"NNF03001","ESCUELA DE POSGRADO"]
["DON0120035","FONDO QEE ELECTRO HIDRÁULICA"," ",1201,"DPTO ARQUITECTURA",null,"PPA21001","PE PRODUCCION ACADEMICA "]
["DON0120036","FONDO ENRIQUE CAVELIER TEXC."," ",1202,"DPTO DISENO",null,"DPO16001","DOCTORADOS"]
["DON0120037","FONDO PROGRAMA QEE ESFERAS PORTAFOLIO."," ",1401,"DPTO HUMA Y LITERATURA",null,"SST02008","LAB DOCENCIA-PROD ACADÉMICA-ASESORIA Y CONSULTORIA-SERVICIOS"]
["DON0120038","FONDO PROGRAMA QEE FAMILIA DIAZ- FNY"," ",1406,"DPTO CEPER",null,"DIF01002","DESARROLLO E INNOVACION FACULTAD USO"]
["DON0120039","FONDO FAMILIA ESPINOSA"," ",1600,"FACULTAD DE CIENCIAS",null,"AVA03205","FDO DOTACION BIBLIOTECA ARTES"]
["DON0120040","FONDO PROGRAMA QEE FAMILIA PATIÑO ALHACH"," ",1804,"DPTO HISTORIA",null,"AVA04401","CONSEJO ESTUDIANTIL UNIANDINO"]
["DON0120041","FONDO PROGRAMA QEE FAMILIA PÉREZ REINA"," ",1806,"DPTO PSICOLOGIA",null,"AVA05102","CONECTA-TE EDUCACION CONTINUADA"]
["DON0120042","FONDO FNY TRIADA"," ",2200,"FACULTAD DE ECONOMIA",null,"AVA05303","CONECTA-TE EXTENSION PROYECTOS EXTERNOS"]
["DON0120043","FONDO PROGRAMA QEE FRANCISCO LEAL"," ",5000,"CENTRO DE ETICA CURSOS EDU CON",null,"PYI03001","CENTRO DE LENGUAS EDU CON"]
["DON0120044","FUNDACIÓN BELCORP"," ",5000,"EDUCONT CENTRO JAPON",null,"AVI01102","VICERRECTORIA DE INVESTIGACIONES EDU CON"]
["DON0120045","FONDO PROGRAMA QEE FUNDACIÓN NEME"," ",5000,"CURSOS DE EXTENSION Y LIBRES DE PREGRADO ",null,"AVA08201","CENTRO DE ETICA CURSOS EDU CON"]
["DON0120046","FONDO PROGRAMA QEE FUNDACIÓN WETTON"," ",2401,"DPTO ING BIOMEDICA",null,"AVI11202","EDUCONT CENTRO JAPON"]
["DON0120047","FONDO PROGRAMA QEE GEOCIENCIAS"," ",2400,"FACULTAD DE INGENIERIA",null,"AVA09203","ESCUELA DE VERANO PARA JOVENES"]
["DON0120048","FONDO PROGRAMA PALANTE CARIBE GEOFLORA"," ",2405,"DPTO ING MECANICA",null,"AVA09204","CURSOS LIBRES DE PREGRADO"]
["DON0120049","BECA QUIERO ESTUDIAR GLORIA BERNAL DE GARLATTI"," ",2406,"DPTO ING QUIMICA Y DE ALIMENTOS",null,"AVS03201","DSIT CURSOS EDUCACIÓN CONTINUA"]
["DON0120050","BECA QUIERO ESTUDIAR DERECHO GÓMEZ PINZÓN ZULETA"," ",2412,"OSP DPTO CIVIL Y AMBIENTAL",null,"AVD03101","DIRECCION DE FILANTROPIA"]
["DON0120051","FONDO HENRI YERLI"," ",1404,"DPTO ARTE ",null,"AVD01101","VICERRECTORIA DE DESARROLLO Y EGRESADOS"]
["DON0120052","PROGRAMA QEE HUGO CAMPOS"," ",2407,"DPTO ING. SISTEMAS",null,"AVS01101","VIC SERVICIOS Y SOSTENIBILIDAD"]
["DON0120053","FONDO APOYO PARA MAESTRÍA EGOB-INVERSIONES ECOLÓGI"," ",2416,"OSP DPTO ING. QUIMICA",null,"AVS05202","PROYECTOS TRANSVERSALES "]
["DON0120054","FONDO PROGRAMA QEE IQUARTIL"," ",2400,"IDEC",null,"REC06003","CONCESIONES"]
["DON0120055","FONDO PROGRAMA PALANTE CARIBE JAIME ROBLEDO"," ",2402,"INGENIERIA CIVIL Y AMBIENTAL",null,"PYI06001","PROYECTOS URBANISTICOS"]
["DON0120056","PROGRAMA QE JOSE CALDERÓN"," ",1405,"DPTO MUSICA",null,"AVI11201","CENTRO DEL JAPON"]
["DON0120057","FONDO PROGRAMA QEE KANTAR IBOPE"," ",2414,"OSP DPTO ING. INDUSTRIAL",null,"IEC26001","CURSOS EDUCACION CONTINUA Y EJECUTIVA"]
["DON0120058","BECA LEONOR  ESCANDÓN DURÁN"," ",1803,"DPTO FILOSOFIA",null,"AVS04501","OFICINA DE RELACIONES PUBLICAS"]
["DON0120059","BECA PEG 50 AÑOS LEONOR ESCANDON DURAN"," ",1802,"DPTO CIENCIA POLITICA",null,"DIF01001","DESARROLLO"]
["DON0120060","PALANTE PACÍFICO LEONOR ESCANDÓN"," ",2411,"OSP DPTO ING. BIOMEDICA",null,"AVA09204","CURSOS DE EXTENSION Y LIBRES DE PREGRADO "]
["DON0120061","FONDO QE ESCALA LEONOR ESCANDÓN DURÁN"," ",2800,"ESCUELA DE GOBIERNO ",null,"DIF02001","DESARROLLO E INNOVACION DPTO FUENTE"]
["DON0120062","FONDO PROGRAMA QEE MANDALA GROUP"," ",1611,"PY DPTO CIENCIAS BIOLOGICAS",null,"IAC24001","PE ASESORIA Y CONSULTORIA "]
["DON0120063","FONDO QE ESCALA MARIO HERNANDEZ"," ",1615,"PY DPTO DE QUIMICA",null,"DPO12001","ESPECIALIZACIONES "]
["DON0120064","BECA MITSUBISHI"," ",2415,"OSP DPTO ING. MECANICA",null,{"$f":"+VLOOKUP(#REF!,'[1]Sede + Unidad + Ceco + Objeto'!$B$4:$L$2893,6,FALSE)","v":{"$error":"#REF!"}},{"$f":"+VLOOKUP(#REF!,'[1]Sede + Unidad + Ceco + Objeto'!$B$4:$L$2893,7,FALSE)","v":{"$error":"#REF!"}}]
{"$rows_left_out":2665}